{"text_format":"1","workbook":"xlsx","n_sheets":3,"sheets":["Introduction","Key","Cincinnati-Course-Mapping Tool"],"not_rendered":{"charts":0,"images":1,"macros":1,"external_links":0,"defined_names":4,"comments":1,"pivot_tables":0},"unopened":[],"bounds":{"document_bytes":16777216,"sheet_cells":100000,"rows_first":2000,"rows_last":500,"rows_between":2000,"halvings":0,"cell_chars":16384,"cell_head_chars":4096},"cells_cut":0,"cells_raw":0,"read":"whole","date_system":"1900"}

{"sheet":"Introduction","index":0,"n_rows":26,"n_cols":4,"rows_kept":26,"cut":false,"hidden":false,"merged":[[29,0,29,14]]}
[]
["Course-Mapping Tool for the MCAT  Exam"]
["The tool What's on the MCAT Exam? available at",null,null,"www.aamc.org/mcat2015exam"]
[]
[]
[]
[]
[]
[]
[]
[]
[]
[]
[]
[]
[]
[]
[]
[]
[]
[]
[]
[]
[]
[]
["For questions contact advisors@aamc.org"]

{"sheet":"Key","index":1,"n_rows":108,"n_cols":2,"rows_kept":108,"cut":false,"hidden":false,"merged":[[2,0,2,1],[16,0,16,1],[10,0,10,1],[11,0,11,1],[12,0,12,1],[14,0,14,1],[13,0,13,1],[15,0,15,1],[7,0,7,1],[6,0,6,1],[5,0,5,1],[4,0,4,1],[3,0,3,1]]}
[]
["KEY"]
["Skills: Scientific Inquiry and Reasoning Skills--the inquiry and reasoning skills that are required to solve scientific problems"]
["Foundational Concept--the big ideas in the sciences that provide the foundation for learning in medicine"]
["Content Category--the topics and subtopics that are needed to understand the foundational concepts"]
["Topic--the topics within the context of the content category which may be tested on the MCAT Exam"]
["Topic taught at your school--Indicates if this topic is taught at your school.  As the tool is completed for those topics which have been marked as taught in a course, the cells will change from Red to White and from NO! to Yes "]
["Topic on Current MCAT--Indicates if this topic (or part of it) appeared on the current exam"]
[]
["What's on the MCAT Exam? course levels. According to baccalaureate faculty survey respondents in 2009, the listed topics were taught in the following courses at most institutions.  Many undergraduate institutions are now creating more flexible course sequences."]
["BIO = two-semester sequence of introductory biology"]
["BC = first-semester biochemistry"]
["OC =two-semester sequence of organic chemistry"]
["GC =  two-semester sequence of general chemistry"]
["PHY =two-semester sequence of introductory physics"]
["PSY = one semester of introductory psychology"]
["SOC = one semester of introductory sociology"]
[]
["Cells shaded in orange:"]
[]
[]
[]
[]
[]
[]
[]
[]
[]
[]
[]
[]
[]
[]
[]
["MCAT2015Exam Structure "]
["Biological and Biochemical Foundations of Living Systems (Foundational Concepts 1-3)"]
["Foundational Concept 1 (FC1):","Biomolecules have unique properties that determine how they contribute to the structure and function of cells and how they participate in the processes necessary to maintain life."]
["Content categories:"]
["CC1A. ","Structure and function of proteins and their constituent amino acids"]
["CC1B. ","Transmission of genetic information from the gene to the protein"]
{"$rows_left_out":69}
{"sheet":"Cincinnati-Course-Mapping Tool","index":2,"n_rows":160,"n_cols":115,"rows_kept":160,"cut":false,"hidden":false,"merged":[]}
[null,null,null,null,null,null,null,"What's on the MCAT Exam Course Levels",null,null,null,null,null,null,null,null,null,null,"Course List at Your School"]
[]
[]
[]
[]
["Skills","Foundational Concept","Content Category","Topic","Topic taught at your school","Topic On Current MCAT","BIO","BC","OC","GC","PHY","PSY","SOC","PD 1000","PSYC 1001","SOC 1001","BIOL 1081","BIOL 1082","CHEM 1040","CHEM 1041","CHEM 2040","CHEM 2041","CHEM 3040","MEDS 3020","MEDS 4027","MEDS 4028","PHYS 1051","PHYS 1052","PHYS 2001","PHYS 2002","Genetics BIOL 2083","Genetics MEDS 3021","BIOL 2085C","Cell BIOL 4011","Micro MEDS 3024","A&P1 BIOL 2001C","A&P2 BIOL 2002C","HC-Anat BIOL 3020C","HC Phys BIOL 3021","Antibiotic Resistance BIOL 5121","G Anat MEDS 4052C","H Phys MEDS 3026","MEDS 3021 MolGen","MEDS 3022 Human Med Gen"]
[null,"FC1  (E5*and parts of E8*)","CC1A","Amino Acids",{"$f":"IF(DK7>0,\"Yes\",\"NO!\")","v":"Yes"},"X",null,"X","X",null,null,null,null,null,null,null,"x",null,null,null,null,"X","X",null,null,null,null,null,null,null,null,null,"x",null,null,"x",null,null,null,null,null,null,"x",null,null,null,null,null,null,null,null,null,null,null,null,null,null,null,null,null,null,null,null,null,null,null,null,null,null,null,null,null,null,null,null,null,null,null,null,null,null,null,null,null,null,null,null,null,null,null,null,null,null,null,null,null,null,null,null,null,null,null,null,null,null,null,null,null,null,null,null,null,null,null,{"$f":"COUNTA(P7:DJ7)","v":6}]
[null,"FC1  (E5*and parts of E8*)","CC1A","Protein Structure ",{"$f":"IF(DK8>0,\"Yes\",\"NO!\")","v":"Yes"},"X","X","X","X",null,null,null,null,null,null,null,"x",null,null,null,null,null,"X",null,null,null,null,null,null,null,null,null,"x",null,null,"x",null,null,null,null,null,null,"x","x",null,null,null,null,null,null,null,null,null,null,null,null,null,null,null,null,null,null,null,null,null,null,null,null,null,null,null,null,null,null,null,null,null,null,null,null,null,null,null,null,null,null,null,null,null,null,null,null,null,null,null,null,null,null,null,null,null,null,null,null,null,null,null,null,null,null,null,null,null,null,6]
[null,"FC1  (E5*and parts of E8*)","CC1A","Non-Enzymatic Protein Function ","Yes",null,"X","X",null,null,null,null,null,null,null,null,"x",null,null,null,null,null,"X",null,null,null,null,null,null,null,null,null,"x",null,null,"x",null,null,null,null,null,null,"x","x",null,null,null,null,null,null,null,null,null,null,null,null,null,null,null,null,null,null,null,null,null,null,null,null,null,null,null,null,null,null,null,null,null,null,null,null,null,null,null,null,null,null,null,null,null,null,null,null,null,null,null,null,null,null,null,null,null,null,null,null,null,null,null,null,null,null,null,null,null,null,6]
[null,"FC1  (E5*and parts of E8*)","CC1A","Enzyme Structure and Function","Yes","X","X","X",null,null,null,null,null,null,null,null,"x",null,null,null,null,null,"X",null,null,null,null,null,null,null,null,null,"x","x",null,"x",null,null,null,null,null,null,null,"x",null,null,null,null,null,null,null,null,null,null,null,null,null,null,null,null,null,null,null,null,null,null,null,null,null,null,null,null,null,null,null,null,null,null,null,null,null,null,null,null,null,null,null,null,null,null,null,null,null,null,null,null,null,null,null,null,null,null,null,null,null,null,null,null,null,null,null,null,null,null,6]
[null,"FC1  (E5*and parts of E8*)","CC1A","Control of Enzyme Activity ","Yes","X","X","X",null,null,null,null,null,null,null,null,"x",null,null,null,null,null,"X",null,null,null,null,null,null,null,null,null,"x",null,null,null,null,null,null,null,null,"X",null,null,null,null,null,null,null,null,null,null,null,null,null,null,null,null,null,null,null,null,null,null,null,null,null,null,null,null,null,null,null,null,null,null,null,null,null,null,null,null,null,null,null,null,null,null,null,null,null,null,null,null,null,null,null,null,null,null,null,null,null,null,null,null,null,null,null,null,null,null,null,null,4]
[null,"FC1  (E5*and parts of E8*)","CC1B","Nucleic Acid Structure and Function","Yes","X","X","X",null,null,null,null,null,null,null,null,"x",null,null,null,null,null,"X",null,null,null,null,null,null,null,"x",null,null,null,null,"x",null,null,null,"x",null,null,"x","x",null,null,null,null,null,null,null,null,null,null,null,null,null,null,null,null,null,null,null,null,null,null,null,null,null,null,null,null,null,null,null,null,null,null,null,null,null,null,null,null,null,null,null,null,null,null,null,null,null,null,null,null,null,null,null,null,null,null,null,null,null,null,null,null,null,null,null,null,null,null,7]
[null,"FC1  (E5*and parts of E8*)","CC1B","DNA Replication","Yes","X","X",null,null,null,null,null,null,null,null,null,"x",null,null,null,null,null,"X",null,null,null,null,null,null,null,"x",null,null,null,null,"x",null,null,null,"x",null,null,"x","x",null,null,null,null,null,null,null,null,null,null,null,null,null,null,null,null,null,null,null,null,null,null,null,null,null,null,null,null,null,null,null,null,null,null,null,null,null,null,null,null,null,null,null,null,null,null,null,null,null,null,null,null,null,null,null,null,null,null,null,null,null,null,null,null,null,null,null,null,null,null,7]
[null,"FC1  (E5*and parts of E8*)","CC1B","Repair of DNA","Yes","X","X",null,null,null,null,null,null,null,null,null,"x",null,null,null,null,null,"X",null,null,null,null,null,null,null,"x",null,null,null,null,"x",null,null,null,"x",null,null,"x","x",null,null,null,null,null,null,null,null,null,null,null,null,null,null,null,null,null,null,null,null,null,null,null,null,null,null,null,null,null,null,null,null,null,null,null,null,null,null,null,null,null,null,null,null,null,null,null,null,null,null,null,null,null,null,null,null,null,null,null,null,null,null,null,null,null,null,null,null,null,null,7]
[null,"FC1  (E5*and parts of E8*)","CC1B","Genetic Code","Yes","X","X",null,null,null,null,null,null,null,null,null,"x",null,null,null,null,null,"X",null,null,null,null,null,null,null,"x",null,null,null,null,"x",null,null,null,"x",null,null,"x","x",null,null,null,null,null,null,null,null,null,null,null,null,null,null,null,null,null,null,null,null,null,null,null,null,null,null,null,null,null,null,null,null,null,null,null,null,null,null,null,null,null,null,null,null,null,null,null,null,null,null,null,null,null,null,null,null,null,null,null,null,null,null,null,null,null,null,null,null,null,null,7]
[null,"FC1  (E5*and parts of E8*)","CC1B","Transcription","Yes","X","X",null,null,null,null,null,null,null,null,null,"x",null,null,null,null,null,"X",null,null,null,null,null,null,null,"x",null,null,null,null,"x",null,null,null,"x",null,null,"x","x",null,null,null,null,null,null,null,null,null,null,null,null,null,null,null,null,null,null,null,null,null,null,null,null,null,null,null,null,null,null,null,null,null,null,null,null,null,null,null,null,null,null,null,null,null,null,null,null,null,null,null,null,null,null,null,null,null,null,null,null,null,null,null,null,null,null,null,null,null,null,7]
[null,"FC1  (E5*and parts of E8*)","CC1B","Translation","Yes","X","X",null,null,null,null,null,null,null,null,null,"x",null,null,null,null,null,"X",null,null,null,null,null,null,null,"x",null,null,null,null,"x",null,null,null,"x",null,null,"x","x",null,null,null,null,null,null,null,null,null,null,null,null,null,null,null,null,null,null,null,null,null,null,null,null,null,null,null,null,null,null,null,null,null,null,null,null,null,null,null,null,null,null,null,null,null,null,null,null,null,null,null,null,null,null,null,null,null,null,null,null,null,null,null,null,null,null,null,null,null,null,7]
[null,"FC1  (E5*and parts of E8*)","CC1B","Eukaryotic Chromosome Organization","Yes","X","X",null,null,null,null,null,null,null,null,null,"x",null,null,null,null,null,null,null,null,null,null,null,null,null,"x",null,null,null,null,"x",null,null,null,null,null,null,"x","x",null,null,null,null,null,null,null,null,null,null,null,null,null,null,null,null,null,null,null,null,null,null,null,null,null,null,null,null,null,null,null,null,null,null,null,null,null,null,null,null,null,null,null,null,null,null,null,null,null,null,null,null,null,null,null,null,null,null,null,null,null,null,null,null,null,null,null,null,null,null,5]
[null,"FC1  (E5*and parts of E8*)","CC1B","Control of Gene Expression in Prokaryotes","Yes",null,"X",null,null,null,null,null,null,null,null,null,"x",null,null,null,null,null,"X",null,null,null,null,null,null,null,"x",null,null,null,null,null,null,null,null,null,null,null,"x",null,null,null,null,null,null,null,null,null,null,null,null,null,null,null,null,null,null,null,null,null,null,null,null,null,null,null,null,null,null,null,null,null,null,null,null,null,null,null,null,null,null,null,null,null,null,null,null,null,null,null,null,null,null,null,null,null,null,null,null,null,null,null,null,null,null,null,null,null,null,null,4]
[null,"FC1  (E5*and parts of E8*)","CC1B","Control of Gene Expresson in Eukaryotes","Yes","X","X",null,null,null,null,null,null,null,null,null,"x",null,null,null,null,null,"X",null,null,null,null,null,null,null,"x",null,null,null,null,"x",null,null,null,null,null,null,"x","x",null,null,null,null,null,null,null,null,null,null,null,null,null,null,null,null,null,null,null,null,null,null,null,null,null,null,null,null,null,null,null,null,null,null,null,null,null,null,null,null,null,null,null,null,null,null,null,null,null,null,null,null,null,null,null,null,null,null,null,null,null,null,null,null,null,null,null,null,null,null,6]
[null,"FC1  (E5*and parts of E8*)","CC1B","Recombinant DNA and Biotechnology","Yes","X","X",null,null,null,null,null,null,null,null,null,"x",null,null,null,null,null,"X",null,null,null,null,null,null,null,"x",null,null,null,null,null,null,null,null,"x",null,null,"x","x",null,null,null,null,null,null,null,null,null,null,null,null,null,null,null,null,null,null,null,null,null,null,null,null,null,null,null,null,null,null,null,null,null,null,null,null,null,null,null,null,null,null,null,null,null,null,null,null,null,null,null,null,null,null,null,null,null,null,null,null,null,null,null,null,null,null,null,null,null,null,6]
[null,"FC1  (E5*and parts of E8*)","CC1C","Evidence that DNA is Genetic Material","Yes",null,"X",null,null,null,null,null,null,null,null,null,"x",null,null,null,null,null,null,null,null,null,null,null,null,null,"x",null,null,null,null,null,null,null,null,null,null,null,"x","x",null,null,null,null,null,null,null,null,null,null,null,null,null,null,null,null,null,null,null,null,null,null,null,null,null,null,null,null,null,null,null,null,null,null,null,null,null,null,null,null,null,null,null,null,null,null,null,null,null,null,null,null,null,null,null,null,null,null,null,null,null,null,null,null,null,null,null,null,null,null,4]
[null,"FC1  (E5*and parts of E8*)","CC1C","Mendelian Concepts","Yes","X","X",null,null,null,null,null,null,null,null,null,"x",null,null,null,null,null,null,null,null,null,null,null,null,null,"x",null,null,null,null,"x",null,null,null,null,null,null,"x","x",null,null,null,null,null,null,null,null,null,null,null,null,null,null,null,null,null,null,null,null,null,null,null,null,null,null,null,null,null,null,null,null,null,null,null,null,null,null,null,null,null,null,null,null,null,null,null,null,null,null,null,null,null,null,null,null,null,null,null,null,null,null,null,null,null,null,null,null,null,null,5]
[null,"FC1  (E5*and parts of E8*)","CC1C","Meiosis and Other Factors Affecting Genetic Variability","Yes","X","X",null,null,null,null,null,null,null,null,null,"x",null,null,null,null,null,null,null,null,null,null,null,null,null,"x",null,null,null,null,"x",null,null,null,null,null,null,"x","x",null,null,null,null,null,null,null,null,null,null,null,null,null,null,null,null,null,null,null,null,null,null,null,null,null,null,null,null,null,null,null,null,null,null,null,null,null,null,null,null,null,null,null,null,null,null,null,null,null,null,null,null,null,null,null,null,null,null,null,null,null,null,null,null,null,null,null,null,null,null,5]
[null,"FC1  (E5*and parts of E8*)","CC1C","Analytic Methods","Yes","X","X",null,null,null,null,null,null,null,null,null,"x",null,null,null,null,null,null,null,null,null,null,null,null,null,"x",null,null,null,null,null,null,null,null,null,null,null,"x","x",null,null,null,null,null,null,null,null,null,null,null,null,null,null,null,null,null,null,null,null,null,null,null,null,null,null,null,null,null,null,null,null,null,null,null,null,null,null,null,null,null,null,null,null,null,null,null,null,null,null,null,null,null,null,null,null,null,null,null,null,null,null,null,null,null,null,null,null,null,null,4]
[null,"FC1  (E5*and parts of E8*)","CC1C","Evolution","Yes","X","X",null,null,null,null,null,null,null,null,null,"x","x",null,null,null,null,null,null,null,null,null,null,null,null,null,null,null,null,null,null,null,"x",null,null,null,null,"x",null,null,null,null,null,null,null,null,null,null,null,null,null,null,null,null,null,null,null,null,null,null,null,null,null,null,null,null,null,null,null,null,null,null,null,null,null,null,null,null,null,null,null,null,null,null,null,null,null,null,null,null,null,null,null,null,null,null,null,null,null,null,null,null,null,null,null,null,null,null,null,4]
[null,"FC1  (E5*and parts of E8*)","CC1D","Principles of Bioenergetics","Yes",null,null,"X",null,"X",null,null,null,null,null,null,"x",null,null,null,null,null,"X",null,null,null,null,null,null,null,null,null,"x","x",null,null,null,null,null,null,null,"X",null,null,null,null,null,null,null,null,null,null,null,null,null,null,null,null,null,null,null,null,null,null,null,null,null,null,null,null,null,null,null,null,null,null,null,null,null,null,null,null,null,null,null,null,null,null,null,null,null,null,null,null,null,null,null,null,null,null,null,null,null,null,null,null,null,null,null,null,null,null,null,null,5]
[null,"FC1  (E5*and parts of E8*)","CC1D","Carbohydrates","Yes","X",null,"X","X",null,null,null,null,null,null,null,"x",null,null,null,null,"X","X",null,null,null,null,null,null,null,null,null,null,null,null,"x",null,null,null,null,null,null,null,"x",null,null,null,null,null,null,null,null,null,null,null,null,null,null,null,null,null,null,null,null,null,null,null,null,null,null,null,null,null,null,null,null,null,null,null,null,null,null,null,null,null,null,null,null,null,null,null,null,null,null,null,null,null,null,null,null,null,null,null,null,null,null,null,null,null,null,null,null,null,null,5]
[null,"FC1  (E5*and parts of E8*)","CC1D","Glycolysis, Gluconeogenesis, and the Pentose Phosphate Pathway","Yes",null,"X","X",null,null,null,null,null,null,null,null,"x",null,null,null,null,null,null,null,null,null,null,null,null,null,null,null,"x","x",null,"x",null,null,"x",null,null,"X",null,null,null,null,null,null,null,null,null,null,null,null,null,null,null,null,null,null,null,null,null,null,null,null,null,null,null,null,null,null,null,null,null,null,null,null,null,null,null,null,null,null,null,null,null,null,null,null,null,null,null,null,null,null,null,null,null,null,null,null,null,null,null,null,null,null,null,null,null,null,null,null,6]
[null,"FC1  (E5*and parts of E8*)","CC1D","Principles of Metabolic Regulation ","Yes",null,"X","X",null,null,null,null,null,null,null,null,"x",null,null,null,null,null,"X",null,null,null,null,null,null,null,null,null,"x","x",null,null,null,null,null,null,null,"X",null,null,null,null,null,null,null,null,null,null,null,null,null,null,null,null,null,null,null,null,null,null,null,null,null,null,null,null,null,null,null,null,null,null,null,null,null,null,null,null,null,null,null,null,null,null,null,null,null,null,null,null,null,null,null,null,null,null,null,null,null,null,null,null,null,null,null,null,null,null,null,null,5]
[null,"FC1  (E5*and parts of E8*)","CC1D","Citric Acid Cycle","Yes",null,"X","X",null,null,null,null,null,null,null,null,"x",null,null,null,null,null,null,null,null,null,null,null,null,null,null,null,"x","x",null,"x",null,null,"x",null,null,null,null,null,null,null,null,null,null,null,null,null,null,null,null,null,null,null,null,null,null,null,null,null,null,null,null,null,null,null,null,null,null,null,null,null,null,null,null,null,null,null,null,null,null,null,null,null,null,null,null,null,null,null,null,null,null,null,null,null,null,null,null,null,null,null,null,null,null,null,null,null,null,null,5]
[null,"FC1  (E5*and parts of E8*)","CC1D","Metabolism of Fatty Acids and Proteins ","Yes","X","X","X",null,null,null,null,null,null,null,null,null,null,null,null,null,null,null,null,null,null,null,null,null,null,null,null,"x","x",null,null,null,null,null,null,null,null,null,null,null,null,null,null,null,null,null,null,null,null,null,null,null,null,null,null,null,null,null,null,null,null,null,null,null,null,null,null,null,null,null,null,null,null,null,null,null,null,null,null,null,null,null,null,null,null,null,null,null,null,null,null,null,null,null,null,null,null,null,null,null,null,null,null,null,null,null,null,null,null,2]
[null,"FC1  (E5*and parts of E8*)","CC1D","Oxidative Phosphorylation  ","Yes","X","X","X",null,null,null,null,null,null,null,null,"x",null,null,null,null,null,null,null,null,null,null,null,null,null,null,null,"x","x",null,"x",null,null,"x",null,null,null,null,null,null,null,null,null,null,null,null,null,null,null,null,null,null,null,null,null,null,null,null,null,null,null,null,null,null,null,null,null,null,null,null,null,null,null,null,null,null,null,null,null,null,null,null,null,null,null,null,null,null,null,null,null,null,null,null,null,null,null,null,null,null,null,null,null,null,null,null,null,null,null,5]
[null,"FC1  (E5*and parts of E8*)","CC1D","Hormonal Regulation and Integration of Metabolism ","Yes",null,null,"X",null,null,null,null,null,null,null,null,null,null,null,null,null,null,null,null,null,null,null,null,null,null,null,null,null,null,null,"x",null,null,null,null,null,"X",null,null,null,null,null,null,null,null,null,null,null,null,null,null,null,null,null,null,null,null,null,null,null,null,null,null,null,null,null,null,null,null,null,null,null,null,null,null,null,null,null,null,null,null,null,null,null,null,null,null,null,null,null,null,null,null,null,null,null,null,null,null,null,null,null,null,null,null,null,null,null,null,2]
[null,"FC2 (E6*)","CC2A","Plasma Membrane ","Yes","X","X","X","X","X",null,null,null,null,null,null,"x",null,null,null,null,null,null,null,null,null,null,null,null,null,null,null,"x","x",null,"x",null,null,null,null,null,"X",null,null,null,null,null,null,null,null,null,null,null,null,null,null,null,null,null,null,null,null,null,null,null,null,null,null,null,null,null,null,null,null,null,null,null,null,null,null,null,null,null,null,null,null,null,null,null,null,null,null,null,null,null,null,null,null,null,null,null,null,null,null,null,null,null,null,null,null,null,null,null,null,5]
[null,"FC2 (E6*)","CC2A","Membrane-Bound Organelles and Defining Characteristics of Eukaryotic Cells ","Yes","X","X","X",null,null,null,null,null,null,null,null,"x",null,null,null,null,null,null,null,null,null,null,null,null,null,null,null,"x",null,null,"x",null,null,null,null,null,"X",null,null,null,null,null,null,null,null,null,null,null,null,null,null,null,null,null,null,null,null,null,null,null,null,null,null,null,null,null,null,null,null,null,null,null,null,null,null,null,null,null,null,null,null,null,null,null,null,null,null,null,null,null,null,null,null,null,null,null,null,null,null,null,null,null,null,null,null,null,null,null,null,4]
[null,"FC2 (E6*)","CC2A","Cytoskeleton","Yes","X","X",null,null,null,null,null,null,null,null,null,"x",null,null,null,null,null,null,null,null,null,null,null,null,null,null,null,"x",null,null,"x",null,null,null,null,null,"X",null,null,null,null,null,null,null,null,null,null,null,null,null,null,null,null,null,null,null,null,null,null,null,null,null,null,null,null,null,null,null,null,null,null,null,null,null,null,null,null,null,null,null,null,null,null,null,null,null,null,null,null,null,null,null,null,null,null,null,null,null,null,null,null,null,null,null,null,null,null,null,null,4]
[null,"FC2 (E6*)","CC2A","Tissues Formed From Eukaryotic Cells","Yes","X","X",null,null,null,null,null,null,null,null,null,null," ",null,null,null,null,null,null,null,null,null,null,null,null,null,null,null,null,null,"x",null,null,null,null,null,"X",null,"x",null,null,null,null,null,null,null,null,null,null,null,null,null,null,null,null,null,null,null,null,null,null,null,null,null,null,null,null,null,null,null,null,null,null,null,null,null,null,null,null,null,null,null,null,null,null,null,null,null,null,null,null,null,null,null,null,null,null,null,null,null,null,null,null,null,null,null,null,null,null,4]
[null,"FC2 (E6*)","CC2B","Cell Theory","Yes",null,"X",null,null,null,null,null,null,null,null,null,"x",null,null,null,null,null,null,null,null,null,null,null,null,null,null,null,null,null,null,"x",null,null,null,null,null,null,null,null,null,null,null,null,null,null,null,null,null,null,null,null,null,null,null,null,null,null,null,null,null,null,null,null,null,null,null,null,null,null,null,null,null,null,null,null,null,null,null,null,null,null,null,null,null,null,null,null,null,null,null,null,null,null,null,null,null,null,null,null,null,null,null,null,null,null,null,null,null,null,{"$f":"COUNTA(P39:DJ39)","v":2}]
[null,"FC2 (E6*)","CC2B","Classification and Structure of Prokaryotic Cells","Yes","X","X",null,null,null,null,null,null,null,null,null,"x",null,null,null,null,null,null,null,null,null,null,null,null,null,null,null,null,"x",null,null,null,null,null,"x",null,null,null,null,null,null,null,null,null,null,null,null,null,null,null,null,null,null,null,null,null,null,null,null,null,null,null,null,null,null,null,null,null,null,null,null,null,null,null,null,null,null,null,null,null,null,null,null,null,null,null,null,null,null,null,null,null,null,null,null,null,null,null,null,null,null,null,null,null,null,null,null,null,null,3]
{"$rows_left_out":120}